Reaction Details
TargetVoltage-dependent L-type calcium channel subunit alpha-1C
LigandBDBM50029415
Substrate/Competitorn/a
Meas. Tech.ChEMBL_92797 (CHEMBL703975)
Ki 26±n/a nM
Citation Campiani, GGarofalo, AFiorini, IBotta, MNacci, VTafi, AChiarini, ABudriesi, RBruni, GRomeo, MR Pyrrolo[2,1-c][1,4]benzothiazines: synthesis, structure-activity relationships, molecular modeling studies, and cardiovascular activity. J Med Chem38:4393-410 (1995) Voltage-dependent L-type calcium channel subunit alpha-1C
Name:Voltage-dependent L-type calcium channel subunit alpha-1C
Type:Enzyme Catalytic Domain
Mol. Mass.:243492.26
Organism:RAT
Description:Calcium channel 0 RAT::P22002
Residue:2169
BDBM50029415
NameBDBM50029415
Synonyms:(6-Chloro-4,4-diphenyl-4H-benzo[b]pyrrolo[1,2-d][1,4]thiazin-1-ylmethyl)-dimethyl-amine | CHEMBL24086
TypeSmall organic molecule
Emp. Form.C26H23ClN2S
Mol. Mass.430.992
SMILESCN(C)Cc1ccc2n1-c1cccc(Cl)c1SC2(c1ccccc1)c1ccccc1