Reaction Details
TargetVoltage-dependent L-type calcium channel subunit alpha-1C
LigandBDBM50029426
Substrate/Competitorn/a
Meas. Tech.ChEMBL_92797 (CHEMBL703975)
Ki 8.3±n/a nM
Citation Campiani, GGarofalo, AFiorini, IBotta, MNacci, VTafi, AChiarini, ABudriesi, RBruni, GRomeo, MR Pyrrolo[2,1-c][1,4]benzothiazines: synthesis, structure-activity relationships, molecular modeling studies, and cardiovascular activity. J Med Chem38:4393-410 (1995) Voltage-dependent L-type calcium channel subunit alpha-1C
Name:Voltage-dependent L-type calcium channel subunit alpha-1C
Type:Enzyme Catalytic Domain
Mol. Mass.:243492.26
Organism:RAT
Description:Calcium channel 0 RAT::P22002
Residue:2169
BDBM50029426
NameBDBM50029426
Synonyms:CHEMBL24675 | [2-(3,4-Dimethoxy-phenyl)-ethyl]-[4-(4-methoxy-phenyl)-4H-benzo[b]pyrrolo[1,2-d][1,4]thiazin-1-ylmethyl]-methyl-amine
TypeSmall organic molecule
Emp. Form.C30H32N2O3S
Mol. Mass.500.652
SMILESCOc1ccc(cc1)C1Sc2ccccc2-n2c(CN(C)CCc3ccc(OC)c(OC)c3)ccc12