Reaction Details
TargetLeukotriene B4 receptor 1
LigandBDBM50029467
Substrate/Competitorn/a
Meas. Tech.ChEMBL_99490 (CHEMBL704378)
Ki 36±n/a nM
Citation Sawyer, JSBach, NJBaker, SRBaldwin, RFBorromeo, PSCockerham, SLFleisch, JHFloreancig, PFroelich, LLJackson, WT Synthetic and structure/activity studies on acid-substituted 2-arylphenols: discovery of 2-[2-propyl-3-[3-[2-ethyl-4-(4-fluorophenyl)-5- hydroxyphenoxy]-propoxy]phenoxy]benzoic acid, a high-affinity leukotriene B4 receptor antagonist. J Med Chem38:4411-32 (1995) Leukotriene B4 receptor 1
Name:Leukotriene B4 receptor 1
Type:Enzyme Catalytic Domain
Mol. Mass.:37582.68
Organism:Homo sapiens (Human)
Description:Q15722
Residue:352
BDBM50029467
NameBDBM50029467
Synonyms:2-{3-[3-(5-Ethyl-4'-fluoro-2-hydroxy-biphenyl-4-yloxy)-propoxy]-2-propyl-benzenesulfonyl}-benzoic acid | CHEMBL139799
TypeSmall organic molecule
Emp. Form.C33H33FO7S
Mol. Mass.592.674
SMILESCCCc1c(OCCCOc2cc(O)c(cc2CC)-c2ccc(F)cc2)cccc1S(=O)(=O)c1ccccc1C(O)=O