Reaction Details
TargetNeutrophil elastase
LigandBDBM50029712
Substrate/Competitorn/a
Meas. Tech.ChEMBL_64004 (CHEMBL672345)
Ki 0.03±n/a nM
Citation Hlasta, DJAckerman, JHCourt, JJFarrell, RPJohnson, JAKofron, JLRobinson, DTTalomie, TGDunlap, RPFranke, CA A novel class of cyclic beta-dicarbonyl leaving groups and their use in the design of benzisothiazolone human leukocyte elastase inhibitors. J Med Chem38:4687-92 (1995) Neutrophil elastase
Name:Neutrophil elastase
Type:Enzyme
Mol. Mass.:28532.38
Organism:Homo sapiens (Human)
Description:P08246
Residue:267
BDBM50029712
NameBDBM50029712
Synonyms:2-(4-Chloro-5-oxo-2,5-dihydro-furan-3-yloxymethyl)-4-isopropyl-6-methoxy-1,1-dioxo-1,2-dihydro-1lambda*6*-benzo[d]isothiazol-3-one | CHEMBL143819
TypeSmall organic molecule
Emp. Form.C16H16ClNO7S
Mol. Mass.401.819
SMILESCOc1cc2c(C(=O)N(COC3=C(Cl)C(=O)OC3)S2(=O)=O)c(c1)C(C)C