Reaction Details
TargetNeutrophil elastase
LigandBDBM50029720
Substrate/Competitorn/a
Meas. Tech.ChEMBL_64004 (CHEMBL672345)
Ki 0.06±n/a nM
Citation Hlasta, DJAckerman, JHCourt, JJFarrell, RPJohnson, JAKofron, JLRobinson, DTTalomie, TGDunlap, RPFranke, CA A novel class of cyclic beta-dicarbonyl leaving groups and their use in the design of benzisothiazolone human leukocyte elastase inhibitors. J Med Chem38:4687-92 (1995) Neutrophil elastase
Name:Neutrophil elastase
Type:Enzyme
Mol. Mass.:28532.38
Organism:Homo sapiens (Human)
Description:P08246
Residue:267
BDBM50029720
NameBDBM50029720
Synonyms:4-Isopropyl-6-methoxy-2-(2-methyl-3-oxo-cyclopent-1-enyloxymethyl)-1,1-dioxo-1,2-dihydro-1lambda*6*-benzo[d]isothiazol-3-one | CHEMBL142288
TypeSmall organic molecule
Emp. Form.C18H21NO6S
Mol. Mass.379.427
SMILESCOc1cc2c(C(=O)N(COC3=C(C)C(=O)CC3)S2(=O)=O)c(c1)C(C)C