Reaction Details
TargetType-1 angiotensin II receptor
LigandBDBM50030718
Substrate/Competitorn/a
Meas. Tech.ChEMBL_899657 (CHEMBL3052668)
IC50 0.130017±n/a nM
Citation  TBA Med Chem Res21:2837-2853 (2012)    Article
 
Type-1 angiotensin II receptor
Name:Type-1 angiotensin II receptor
Type:Enzyme Catalytic Domain
Mol. Mass.:41009.15
Organism:RABBIT
Description:ANGIOTENSIN AT1 AGTR1 RABBIT::P34976
Residue:359
BDBM50030718
NameBDBM50030718
Synonyms:CHEMBL332576 | N-{3-[3-Butyl-4-(3-fluoro-2-(N-t-butyloxycarbonyl)-Sulfanamido-biphenyl-4-ylmethyl)-5-oxo-4,5-dihydro-[1,2,4]triazol-1-yl]-4-trifluoromethyl-phenyl}-propionamide
TypeSmall organic molecule
Emp. Form.C32H33F4N5O6S
Mol. Mass.691.693
SMILESCCCCc1nn(-c2cc(NC(=O)CC)ccc2C(F)(F)F)c(=O)n1Cc1ccc(cc1F)-c1ccccc1S(=O)(=O)NC(=O)OCC