Reaction Details
TargetRetinoic acid receptor gamma
LigandBDBM50029774
Substrate/Competitorn/a
Meas. Tech.ChEMBL_196325 (CHEMBL806268)
Kd 3±n/a nM
Citation Johnson, ATKlein, ESGillett, SJWang, LSong, TKPino, MEChandraratna, RA Synthesis and characterization of a highly potent and effective antagonist of retinoic acid receptors. J Med Chem38:4764-7 (1996) Retinoic acid receptor gamma
Name:Retinoic acid receptor gamma
Type:PROTEIN
Mol. Mass.:50345.43
Organism:Homo sapiens (Human)
Description:ChEMBL_1458016
Residue:454
BDBM50029774
NameBDBM50029774
Synonyms:4-(5,5-Dimethyl-8-p-tolyl-5,6-dihydro-naphthalen-2-ylethynyl)-benzoic acid | CHEMBL358145
TypeSmall organic molecule
Emp. Form.C28H24O2
Mol. Mass.392.489
SMILESCc1ccc(cc1)C1=CCC(C)(C)c2ccc(cc12)C#Cc1ccc(cc1)C(O)=O