Reaction Details
TargetRetinoic acid receptor RXR-alpha
LigandBDBM31883
Substrate/Competitorn/a
Meas. Tech.ChEMBL_196912 (CHEMBL807374)
Kd 9±n/a nM
Citation Johnson, ATKlein, ESGillett, SJWang, LSong, TKPino, MEChandraratna, RA Synthesis and characterization of a highly potent and effective antagonist of retinoic acid receptors. J Med Chem38:4764-7 (1996) Retinoic acid receptor RXR-alpha
Name:Retinoic acid receptor RXR-alpha
Type:PROTEIN
Mol. Mass.:50820.38
Organism:Homo sapiens (Human)
Description:ChEMBL_1456363
Residue:462
BDBM31883
NameBDBM31883
Synonyms:9-cis-retinoic acid (9cRA) AT-RA CHEMBL38 SMR000058245 Vitamin A acid [3H]Retinoic acid [3H]tretinoin cid_444795
Typeradiolabeled ligand
Emp. Form.C20H28O2
Mol. Mass.300.4351
SMILESC\C(\C=C\C1=C(C)CCCC1(C)C)=C/C=C/C(/C)=C/C(O)=O