Reaction Details
TargetMuscarinic acetylcholine receptor DM1
LigandBDBM50071171
Substrate/Competitorn/a
Meas. Tech.ChEMBL_906757 (CHEMBL3053219)
Ki 1430±n/a nM
Citation Honda, HTomizawa, MCasida, JE Insect muscarinic acetylcholine receptor: pharmacological and toxicological profiles of antagonists and agonists. J Agric Food Chem55:2276-81 (2007) 
 
Muscarinic acetylcholine receptor DM1
Name:Muscarinic acetylcholine receptor DM1
Type:PROTEIN
Mol. Mass.:86647.10
Organism:Drosophila melanogaster
Description:ChEMBL_106611
Residue:805
BDBM50071171
NameBDBM50071171
Synonyms:9-Methoxy-2-methyl-11,12-dihydro-3H,6aH,13H-6-oxa-3,12a-diaza-benzo[a]cyclopenta[h]anthracene-1-carboxylic acid ethyl ester | CHEMBL59898
TypeSmall organic molecule
Emp. Form.C23H24N2O4
Mol. Mass.392.4477
SMILESCCOC(=O)c1c(C)[nH]c2ccc3OC4N(CCc5cc(OC)ccc45)Cc3c12