Reaction Details
TargetMuscarinic acetylcholine receptor DM1
LigandBDBM50064176
Substrate/Competitorn/a
Meas. Tech.ChEMBL_906757 (CHEMBL3053219)
Ki 3860±n/a nM
Citation Honda, HTomizawa, MCasida, JE Insect muscarinic acetylcholine receptor: pharmacological and toxicological profiles of antagonists and agonists. J Agric Food Chem55:2276-81 (2007) 
 
Muscarinic acetylcholine receptor DM1
Name:Muscarinic acetylcholine receptor DM1
Type:PROTEIN
Mol. Mass.:86647.10
Organism:Drosophila melanogaster
Description:ChEMBL_106611
Residue:805
BDBM50064176
NameBDBM50064176
Synonyms:CHEMBL27673 METHOCTRAMINE N1,N8-bis(6-(2-methoxybenzylamino)hexyl)octane-1,8-diamine
TypeSmall organic molecule
Emp. Form.C36H62N4O2
Mol. Mass.582.9031
SMILESCOc1ccccc1CNCCCCCCNCCCCCCCCNCCCCCCNCc1ccccc1OC