Reaction Details
TargetPeptidylglycine alpha-amidating monooxygenase
LigandBDBM50030348
Substrate/Competitorn/a
Meas. Tech.ChEMBL_154488 (CHEMBL765265)
IC50 4200±n/a nM
Citation Erion, MDTan, JWong, MJeng, AY Inhibition of peptidylglycine alpha-amidating monooxygenase by N-substituted homocysteine analogs. J Med Chem37:4430-7 (1995) Peptidylglycine alpha-amidating monooxygenase
Name:Peptidylglycine alpha-amidating monooxygenase
Type:PROTEIN
Mol. Mass.:108665.78
Organism:Rattus norvegicus
Description:ChEMBL_536304
Residue:976
BDBM50030348
NameBDBM50030348
Synonyms:CHEMBL139052 | {(S)-2-[(R)-2-(5-Dimethylamino-naphthalene-1-sulfonylamino)-3-(4-hydroxy-phenyl)-propionylamino]-3-phenyl-propionylamino}-acetic acid
TypeSmall organic molecule
Emp. Form.C32H34N4O7S
Mol. Mass.618.7
SMILESCN(C)c1cccc2c(cccc12)S(=O)(=O)N[C@H](Cc1ccc(O)cc1)C(=O)N[C@@H](Cc1ccccc1)C(=O)NCC(O)=O