Reaction Details
TargetPeptidylglycine alpha-amidating monooxygenase
LigandBDBM50030353
Substrate/Competitorn/a
Meas. Tech.ChEMBL_154488 (CHEMBL765265)
IC50 330±n/a nM
Citation Erion, MDTan, JWong, MJeng, AY Inhibition of peptidylglycine alpha-amidating monooxygenase by N-substituted homocysteine analogs. J Med Chem37:4430-7 (1995) Peptidylglycine alpha-amidating monooxygenase
Name:Peptidylglycine alpha-amidating monooxygenase
Type:PROTEIN
Mol. Mass.:108665.78
Organism:Rattus norvegicus
Description:ChEMBL_536304
Residue:976
BDBM50030353
NameBDBM50030353
Synonyms:(R)-3-Mercapto-2-[(S)-3-phenyl-2-(3-phenyl-propionylamino)-propionylamino]-propionic acid | CHEMBL337783
TypeSmall organic molecule
Emp. Form.C21H24N2O4S
Mol. Mass.400.491
SMILESOC(=O)[C@H](CS)NC(=O)[C@H](Cc1ccccc1)NC(=O)CCc1ccccc1