Reaction Details
TargetPeptidylglycine alpha-amidating monooxygenase
LigandBDBM50030354
Substrate/Competitorn/a
Meas. Tech.ChEMBL_154488 (CHEMBL765265)
IC50 53±n/a nM
Citation Erion, MDTan, JWong, MJeng, AY Inhibition of peptidylglycine alpha-amidating monooxygenase by N-substituted homocysteine analogs. J Med Chem37:4430-7 (1995) Peptidylglycine alpha-amidating monooxygenase
Name:Peptidylglycine alpha-amidating monooxygenase
Type:PROTEIN
Mol. Mass.:108665.78
Organism:Rattus norvegicus
Description:ChEMBL_536304
Residue:976
BDBM50030354
NameBDBM50030354
Synonyms:(S)-2-((S)-2-tert-Butoxycarbonylamino-3-phenyl-propionylamino)-4-mercapto-butyric acid | CHEMBL137919
TypeSmall organic molecule
Emp. Form.C18H26N2O5S
Mol. Mass.382.474
SMILESCC(C)(C)OC(=O)N[C@@H](Cc1ccccc1)C(=O)N[C@@H](CCS)C(O)=O