Reaction Details
TargetPeptidylglycine alpha-amidating monooxygenase
LigandBDBM50030356
Substrate/Competitorn/a
Meas. Tech.ChEMBL_154488 (CHEMBL765265)
IC50>10000±n/a nM
Citation Erion, MDTan, JWong, MJeng, AY Inhibition of peptidylglycine alpha-amidating monooxygenase by N-substituted homocysteine analogs. J Med Chem37:4430-7 (1995) Peptidylglycine alpha-amidating monooxygenase
Name:Peptidylglycine alpha-amidating monooxygenase
Type:PROTEIN
Mol. Mass.:108665.78
Organism:Rattus norvegicus
Description:ChEMBL_536304
Residue:976
BDBM50030356
NameBDBM50030356
Synonyms:(S)-2-[(S)-3-Phenyl-2-(3-phenyl-propionylamino)-propionylamino]-succinic acid | CHEMBL337795
TypeSmall organic molecule
Emp. Form.C22H24N2O6
Mol. Mass.412.4358
SMILESOC(=O)C[C@H](NC(=O)[C@H](Cc1ccccc1)NC(=O)CCc1ccccc1)C(O)=O