Reaction Details
TargetPeptidylglycine alpha-amidating monooxygenase
LigandBDBM50030355
Substrate/Competitorn/a
Meas. Tech.ChEMBL_154488 (CHEMBL765265)
IC50 39±n/a nM
Citation Erion, MDTan, JWong, MJeng, AY Inhibition of peptidylglycine alpha-amidating monooxygenase by N-substituted homocysteine analogs. J Med Chem37:4430-7 (1995) Peptidylglycine alpha-amidating monooxygenase
Name:Peptidylglycine alpha-amidating monooxygenase
Type:PROTEIN
Mol. Mass.:108665.78
Organism:Rattus norvegicus
Description:ChEMBL_536304
Residue:976
BDBM50030355
NameBDBM50030355
Synonyms:(S)-2-[(S)-2-((R)-2-tert-Butoxycarbonylamino-3-phenyl-propionylamino)-3-phenyl-propionylamino]-4-mercapto-butyric acid | CHEMBL342409
TypeSmall organic molecule
Emp. Form.C27H35N3O6S
Mol. Mass.529.648
SMILESCC(C)(C)OC(=O)N[C@H](Cc1ccccc1)C(=O)N[C@@H](Cc1ccccc1)C(=O)N[C@@H](CCS)C(O)=O