Reaction Details
TargetPeptidylglycine alpha-amidating monooxygenase
LigandBDBM50030360
Substrate/Competitorn/a
Meas. Tech.ChEMBL_154488 (CHEMBL765265)
IC50 160±n/a nM
Citation Erion, MDTan, JWong, MJeng, AY Inhibition of peptidylglycine alpha-amidating monooxygenase by N-substituted homocysteine analogs. J Med Chem37:4430-7 (1995) Peptidylglycine alpha-amidating monooxygenase
Name:Peptidylglycine alpha-amidating monooxygenase
Type:PROTEIN
Mol. Mass.:108665.78
Organism:Rattus norvegicus
Description:ChEMBL_536304
Residue:976
BDBM50030360
NameBDBM50030360
Synonyms:4-Mercapto-2-[(S)-3-methyl-2-(3-phenyl-propionylamino)-butyrylamino]-butyric acid | CHEMBL134739
TypeSmall organic molecule
Emp. Form.C18H26N2O4S
Mol. Mass.366.475
SMILESCC(C)[C@H](NC(=O)CCc1ccccc1)C(=O)NC(CCS)C(O)=O