Reaction Details
TargetPeptidylglycine alpha-amidating monooxygenase
LigandBDBM50030362
Substrate/Competitorn/a
Meas. Tech.ChEMBL_154488 (CHEMBL765265)
IC50>10000±n/a nM
Citation Erion, MDTan, JWong, MJeng, AY Inhibition of peptidylglycine alpha-amidating monooxygenase by N-substituted homocysteine analogs. J Med Chem37:4430-7 (1995) Peptidylglycine alpha-amidating monooxygenase
Name:Peptidylglycine alpha-amidating monooxygenase
Type:PROTEIN
Mol. Mass.:108665.78
Organism:Rattus norvegicus
Description:ChEMBL_536304
Residue:976
BDBM50030362
NameBDBM50030362
Synonyms:(S)-2-{(S)-2-[(R)-2-tert-Butoxycarbonylamino-3-(4-hydroxy-phenyl)-propionylamino]-3-phenyl-propionylamino}-3-hydroxy-propionic acid | CHEMBL139380
TypeSmall organic molecule
Emp. Form.C26H33N3O8
Mol. Mass.515.5555
SMILESCC(C)(C)OC(=O)N[C@H](Cc1ccc(O)cc1)C(=O)N[C@@H](Cc1ccccc1)C(=O)N[C@@H](CO)C(O)=O