Reaction Details
TargetAcetylcholine-binding protein
LigandBDBM50472282
Substrate/Competitorn/a
Meas. Tech.ChEMBL_908842 (CHEMBL3067864)
Ki 16±n/a nM
Citation Tomizawa, MCasida, JE Unique neonicotinoid binding conformations conferring selective receptor interactions. J Agric Food Chem59:2825-8 (2011) 
 
Acetylcholine-binding protein
Name:Acetylcholine-binding protein
Type:n/a
Mol. Mass.:26055.52
Organism:Lymnaea stagnalis
Description:Soluble acetylcholine receptor
Residue:229
BDBM50472282
NameBDBM50472282
Synonyms:descyanothiacloprid
TypeSmall organic molecule
Emp. Form.C9H10ClN3S
Mol. Mass.227.714
SMILESClc1ccc(CN2CCSC2=N)cn1