Reaction Details
TargetGag-Pol polyprotein [489-587]
LigandBDBM50030567
Substrate/Competitorn/a
Meas. Tech.ChEMBL_195211 (CHEMBL804230)
IC50 1900±n/a nM
Citation Xie, LXie, JXKashiwada, YCosentino, LMLiu, SHPai, RBCheng, YCLee, KH Anti-AIDS (acquired immune deficiency syndrome) agents. 17. New brominated hexahydroxybiphenyl derivatives as potent anti-HIV agents. J Med Chem38:3003-8 (1995) Gag-Pol polyprotein [489-587]
Name:Gag-Pol polyprotein [489-587]
Type:Enzyme Subunit
Mol. Mass.:10781.16
Organism:Human immunodeficiency virus type 1
Description:P04585[489-587]
Residue:99
BDBM50030567
NameBDBM50030567
Synonyms:6,6'-Dibromo-7,7'-dimethoxy-[4,4']bi[benzo[1,3]dioxolyl]-5,5'-dicarboxylic acid dimethyl ester | CHEMBL103217
TypeSmall organic molecule
Emp. Form.C20H16Br2O10
Mol. Mass.576.143
SMILESCOC(=O)c1c(Br)c(OC)c2OCOc2c1-c1c2OCOc2c(OC)c(Br)c1C(=O)OC