Reaction Details
TargetAlpha-1B adrenergic receptor
LigandBDBM50118703
Substrate/Competitorn/a
Meas. Tech.ChEMBL_911066 (CHEMBL3056713)
Ki 2951±n/a nM
Citation  TBA Med Chem Res13:134-148 (2004)    Article
 
Alpha-1B adrenergic receptor
Name:Alpha-1B adrenergic receptor
Type:Enzyme Catalytic Domain
Mol. Mass.:56514.13
Organism:HAMSTER
Description:adrenergic Alpha1 0 HAMSTER::P18841
Residue:515
BDBM50118703
NameBDBM50118703
Synonyms:CHEMBL109783 | N-[5-(4,5-Dihydro-1H-imidazol-2-yl)-2-hydroxy-5,6,7,8-tetrahydro-naphthalen-1-yl]-methanesulfonamide
TypeSmall organic molecule
Emp. Form.C14H19N3O3S
Mol. Mass.309.384
SMILESCS(=O)(=O)Nc1c(O)ccc2C(CCCc12)C1=NCCN1