Reaction Details
TargetProstaglandin G/H synthase 2
LigandBDBM50289331
Substrate/Competitorn/a
Meas. Tech.ChEMBL_911478 (CHEMBL3054902)
IC50 12882496±n/a nM
Citation  TBA Med Chem Res13:337-347 (2004)    Article
 
Prostaglandin G/H synthase 2
Name:Prostaglandin G/H synthase 2
Type:Enzyme
Mol. Mass.:69003.89
Organism:Homo sapiens (Human)
Description:Recombinant Cox-2 provided by Cayman (Cayman Chemical Co.,Ann Arbor, MI).
Residue:604
BDBM50289331
NameBDBM50289331
Synonyms:6-(3-Fluoro-phenyl)-5-(4-methanesulfonyl-phenyl)-2-trifluoromethyl-thiazolo[3,2-b][1,2,4]triazole | CHEMBL155927
TypeSmall organic molecule
Emp. Form.C18H11F4N3O2S2
Mol. Mass.441.422
SMILESCS(=O)(=O)c1ccc(cc1)-c1sc2nc(nn2c1-c1cccc(F)c1)C(F)(F)F