Reaction Details
TargetEpidermal growth factor receptor
LigandBDBM50148235
Substrate/Competitorn/a
Meas. Tech.ChEMBL_911946 (CHEMBL3056386)
IC50 930037±n/a nM
Citation  TBA Med Chem Res13:605-618 (2004)    Article
 
Epidermal growth factor receptor
Name:Epidermal growth factor receptor
Type:Receptor Kinase Domain
Mol. Mass.:134279.59
Organism:Homo sapiens (Human)
Description:P00533
Residue:1210
BDBM50148235
NameBDBM50148235
Synonyms:3-(2-Methoxy-ethoxy)-propynoic acid [4-(3-bromo-phenylamino)-3-cyano-quinolin-6-yl]-amide | CHEMBL115440
TypeSmall organic molecule
Emp. Form.C23H19BrN4O3
Mol. Mass.479.326
SMILESCOCCOCC#CC(=O)Nc1ccc2ncc(C#N)c(Nc3cccc(Br)c3)c2c1