Reaction Details
TargetGlycogen synthase kinase-3 beta
LigandBDBM50147458
Substrate/Competitorn/a
Meas. Tech.ChEMBL_1969952 (CHEMBL4602770)
IC50 7.0±n/a nM
Citation Xu, MWang, SLZhu, LWu, PYDai, WBRakesh, KP Structure-activity relationship (SAR) studies of synthetic glycogen synthase kinase-3? inhibitors: A critical review. Eur J Med Chem164:448-470 (2019) 
 
Glycogen synthase kinase-3 beta
Name:Glycogen synthase kinase-3 beta
Type:Enzyme
Mol. Mass.:46756.38
Organism:Homo sapiens (Human)
Description:P49841
Residue:420
BDBM50147458
NameBDBM50147458
Synonyms:(3-{3-[4-(2-Methoxy-phenyl)-2,5-dioxo-2,5-dihydro-1H-pyrrol-3-yl]-pyrrolo[2,3-b]pyridin-1-yl}-propyl)-carbamic acid tert-butyl ester | CHEMBL109981
TypeSmall organic molecule
Emp. Form.C26H28N4O5
Mol. Mass.476.5243
SMILESCOc1ccccc1C1=C(C(=O)NC1=O)c1cn(CCCNC(=O)OC(C)(C)C)c2ncccc12