Reaction Details
TargetKappa-type opioid receptor
LigandBDBM50031573
Substrate/Competitorn/a
Meas. Tech.ChEMBL_146529 (CHEMBL753841)
Ki 0.140000±n/a nM
Citation Arttamangkul, SMurray, TFDeLander, GEAldrich, JV Synthesis and opioid activity of conformationally constrained dynorphin A analogues. 1. Conformational constraint in the"message" sequence. J Med Chem38:2410-7 (1995) Kappa-type opioid receptor
Name:Kappa-type opioid receptor
Type:G Protein-Coupled Receptor (GPCR)
Mol. Mass.:42744.99
Organism:Cavia porcellus (domestic guinea pig)
Description:P41144
Residue:380
BDBM50031573
NameBDBM50031573
Synonyms:CHEMBL2369870 | [D-Asp2,Dab(Tmg)5]Dyn A-(1-13)NH2
TypeSmall organic molecule
Emp. Form.C80H136N28O16
Mol. Mass.1746.1138
SMILES[#6]-[#6]-[#6@H](-[#6])-[#6@H](-[#7]-[#6](=O)-[#6@H](-[#6]-[#6]-[#6]\[#7]=[#6](\[#7])-[#7])-[#7]-[#6](=O)-[#6@H](-[#6]-[#6]-[#6]\[#7]=[#6](\[#7])-[#7])-[#7]-[#6](=O)-[#6@H](-[#6]-[#6]-[#7]=[#6](-[#7](-[#6])-[#6])-[#7](-[#6])-[#6])-[#7]-[#6](=O)-[#6@H](-[#6]-c1ccccc1)-[#7]-[#6](=O)-[#6]-[#7]-[#6](=O)-[#6@@H](-[#6]-[#6](-[#8])=O)-[#7]-[#6](=O)-[#6@@H](-[#7])-[#6]-c1ccc(-[#8])cc1)-[#6](=O)-[#7]-[#6@@H](-[#6]-[#6]-[#6]\[#7]=[#6](\[#7])-[#7])-[#6](=O)-[#7]-1-[#6]-[#6]-[#6]-[#6@H]-1-[#6](=O)-[#7]-[#6@@H](-[#6]-[#6]-[#6]-[#6]-[#7])-[#6](=O)-[#7]-[#6@@H](-[#6]-[#6](-[#6])-[#6])-[#6](=O)-[#7]-[#6@@H](-[#6]-[#6]-[#6]-[#6]-[#7])-[#6](-[#7])=O