Reaction Details
TargetMu-type opioid receptor
LigandBDBM50031570
Substrate/Competitorn/a
Meas. Tech.ChEMBL_149001 (CHEMBL757985)
Ki 0.16±n/a nM
Citation Arttamangkul, SMurray, TFDeLander, GEAldrich, JV Synthesis and opioid activity of conformationally constrained dynorphin A analogues. 1. Conformational constraint in the"message" sequence. J Med Chem38:2410-7 (1995) Mu-type opioid receptor
Name:Mu-type opioid receptor
Type:G Protein-Coupled Receptor (GPCR)
Mol. Mass.:44503.11
Organism:Rattus norvegicus (rat)
Description:Competition binding assays were carried out using membrane preparations from transfected HN9.10 cells that constitutively expressed the mu opioid receptor.
Residue:398
BDBM50031570
NameBDBM50031570
Synonyms:CHEMBL2369885 | [D-Asp2,Dap(Tmg)5]Dyn A-(1-13)NH2
TypeSmall organic molecule
Emp. Form.C79H134N28O16
Mol. Mass.1732.0873
SMILES[#6]-[#6]-[#6@H](-[#6])-[#6@H](-[#7]-[#6](=O)-[#6@H](-[#6]-[#6]-[#6]\[#7]=[#6](\[#7])-[#7])-[#7]-[#6](=O)-[#6@H](-[#6]-[#6]-[#6]\[#7]=[#6](\[#7])-[#7])-[#7]-[#6](=O)-[#6@H](-[#6]\[#7]=[#6](\[#7](-[#6])-[#6])-[#7](-[#6])-[#6])-[#7]-[#6](=O)-[#6@H](-[#6]-c1ccccc1)-[#7]-[#6](=O)-[#6]-[#7]-[#6](=O)-[#6@@H](-[#6]-[#6](-[#8])=O)-[#7]-[#6](=O)-[#6@@H](-[#7])-[#6]-c1ccc(-[#8])cc1)-[#6](=O)-[#7]-[#6@@H](-[#6]-[#6]-[#6]\[#7]=[#6](\[#7])-[#7])-[#6](=O)-[#7]-1-[#6]-[#6]-[#6]-[#6@H]-1-[#6](=O)-[#7]-[#6@@H](-[#6]-[#6]-[#6]-[#6]-[#7])-[#6](=O)-[#7]-[#6@@H](-[#6]-[#6](-[#6])-[#6])-[#6](=O)-[#7]-[#6@@H](-[#6]-[#6]-[#6]-[#6]-[#7])-[#6](-[#7])=O