Reaction Details
TargetDihydrofolate reductase
LigandBDBM50029766
Substrate/Competitorn/a
Meas. Tech.ChEMBL_54946 (CHEMBL669017)
IC50 7.6±n/a nM
Citation Rosowsky, AForsch, RAQueener, SF 2,4-Diaminopyrido[3,2-d]pyrimidine inhibitors of dihydrofolate reductase from Pneumocystis carinii and Toxoplasma gondii. J Med Chem38:2615-20 (1995) Dihydrofolate reductase
Name:Dihydrofolate reductase
Type:Enzyme
Mol. Mass.:21638.84
Organism:Rattus norvegicus (rat)
Description:n/a
Residue:187
BDBM50029766
NameBDBM50029766
Synonyms:2,4-DIAMINO-5-METHYL-6-[(3,4,5-TRIMETHOXY-N-METHYLANILINO)METHYL]PYRIDO[2,3-D]PYRIMIDINE CHEMBL50514
TypeSmall organic molecule
Emp. Form.C19H24N6O3
Mol. Mass.384.4323
SMILESCOc1cc(cc(OC)c1OC)N(C)Cc1cnc2nc(N)nc(N)c2c1C