Reaction Details
TargetDihydrofolate reductase
LigandBDBM18224
Substrate/Competitorn/a
Meas. Tech.ChEMBL_54946 (CHEMBL669017)
IC50 1.5±n/a nM
Citation Rosowsky, AForsch, RAQueener, SF 2,4-Diaminopyrido[3,2-d]pyrimidine inhibitors of dihydrofolate reductase from Pneumocystis carinii and Toxoplasma gondii. J Med Chem38:2615-20 (1995) Dihydrofolate reductase
Name:Dihydrofolate reductase
Type:Enzyme
Mol. Mass.:21638.84
Organism:Rattus norvegicus (rat)
Description:n/a
Residue:187
BDBM18224
NameBDBM18224
Synonyms:6-[(2,5-dimethoxyphenyl)methyl]-5-methylpyrido[2,3-d]pyrimidine-2,4-diamine PTX [2-amino-6-(2,5-dimethoxybenzyl)-5-methyl-pyrido[2,3-d]pyrimidin-4-yl]amine;2-hydroxyethanesulfonic acid
TypeSmall organic molecule
Emp. Form.C17H19N5O2
Mol. Mass.325.3651
SMILESCOc1ccc(OC)c(Cc2cnc3nc(N)nc(N)c3c2C)c1