Reaction Details
TargetTelomerase reverse transcriptase
LigandBDBM50440391
Substrate/Competitorn/a
Meas. Tech.ChEMBL_912479 (CHEMBL3056937)
IC50 28183829±n/a nM
Citation  TBA Med Chem Res21:853-866 (2012)    Article
 
Telomerase reverse transcriptase
Name:Telomerase reverse transcriptase
Type:PROTEIN
Mol. Mass.:127099.03
Organism:Homo sapiens (Human)
Description:ChEMBL_1447029
Residue:1132
BDBM50440391
NameBDBM50440391
Synonyms:CHEMBL2425367
TypeSmall organic molecule
Emp. Form.C32H40N6
Mol. Mass.508.7002
SMILESCN(C)CCCNCc1ccc2nc3c(ccc4nc5ccc(CNCCCN(C)C)cc5cc34)cc2c1