Reaction Details
Target5-hydroxytryptamine receptor 2C
LigandBDBM50314617
Substrate/Competitorn/a
Meas. Tech.ChEMBL_912546 (CHEMBL3056866)
EC50 22±n/a nM
Citation  TBA Med Chem Res21:1491-1508 (2012)    Article
 
5-hydroxytryptamine receptor 2C
Name:5-hydroxytryptamine receptor 2C
Type:G Protein-Coupled Receptor (GPCR)
Mol. Mass.:51836.79
Organism:Homo sapiens (Human)
Description:P28335
Residue:458
BDBM50314617
NameBDBM50314617
Synonyms:(2S,6R)-4-((3,5-dimethylisoxazol-4-yl)methoxy)-2,6-difluorobenzyl 2,6-dimethylpiperazine-1-carboxylate | CHEMBL1091452
TypeSmall organic molecule
Emp. Form.C20H25F2N3O4
Mol. Mass.409.427
SMILESC[C@H]1CNC[C@@H](C)N1C(=O)OCc1c(F)cc(OCc2c(C)noc2C)cc1F