Reaction Details
TargetAcetylcholinesterase
LigandBDBM50032380
Substrate/Competitorn/a
Meas. Tech.ChEMBL_29093 (CHEMBL636831)
IC50 2300±n/a nM
Citation Vidaluc, JLCalmel, FBigg, DCCarilla, EBriley, M Flexible 1-[(2-aminoethoxy)alkyl]-3-ar(o)yl(thio)ureas as novel acetylcholinesterase inhibitors. Synthesis and biochemical evaluation. J Med Chem38:2969-73 (1995) Acetylcholinesterase
Name:Acetylcholinesterase
Type:Enzyme
Mol. Mass.:68193.62
Organism:Rattus norvegicus (rat)
Description:P37136
Residue:614
BDBM50032380
NameBDBM50032380
Synonyms:1-(2-(2-(benzyl(methyl)amino)ethoxy)ethyl)-3-(4-nitrophenyl)urea CHEMBL98497
TypeSmall organic molecule
Emp. Form.C19H24N4O4
Mol. Mass.372.4183
SMILESCN(CCOCCNC(=O)Nc1ccc(cc1)[N+]([O-])=O)Cc1ccccc1