Reaction Details
TargetAcetylcholinesterase
LigandBDBM50032382
Substrate/Competitorn/a
Meas. Tech.ChEMBL_29093 (CHEMBL636831)
IC50 55±n/a nM
Citation Vidaluc, JLCalmel, FBigg, DCCarilla, EBriley, M Flexible 1-[(2-aminoethoxy)alkyl]-3-ar(o)yl(thio)ureas as novel acetylcholinesterase inhibitors. Synthesis and biochemical evaluation. J Med Chem38:2969-73 (1995) Acetylcholinesterase
Name:Acetylcholinesterase
Type:Enzyme
Mol. Mass.:68193.62
Organism:Rattus norvegicus (rat)
Description:P37136
Residue:614
BDBM50032382
NameBDBM50032382
Synonyms:1-{2-[2-(Benzyl-methyl-amino)-ethoxy]-ethyl}-3-(3,4-dichloro-benzoyl)-thiourea N-(2-(2-(benzyl(methyl)amino)ethoxy)ethylcarbamothioyl)-3,4-dichlorobenzamide
TypeSmall organic molecule
Emp. Form.C20H23Cl2N3O2S
Mol. Mass.440.387
SMILESCN(CCOCCNC(=S)NC(=O)c1ccc(Cl)c(Cl)c1)Cc1ccccc1