Reaction Details
TargetAcetylcholinesterase
LigandBDBM50032383
Substrate/Competitorn/a
Meas. Tech.ChEMBL_29093 (CHEMBL636831)
IC50 230±n/a nM
Citation Vidaluc, JLCalmel, FBigg, DCCarilla, EBriley, M Flexible 1-[(2-aminoethoxy)alkyl]-3-ar(o)yl(thio)ureas as novel acetylcholinesterase inhibitors. Synthesis and biochemical evaluation. J Med Chem38:2969-73 (1995) Acetylcholinesterase
Name:Acetylcholinesterase
Type:Enzyme
Mol. Mass.:68193.62
Organism:Rattus norvegicus (rat)
Description:P37136
Residue:614
BDBM50032383
NameBDBM50032383
Synonyms:1-{2-[2-(Benzyl-methyl-amino)-ethoxy]-ethyl}-3-(biphenyl-4-carbonyl)-thiourea N-(2-(2-(benzyl(methyl)amino)ethoxy)ethylcarbamothioyl)biphenyl-4-carboxamide
TypeSmall organic molecule
Emp. Form.C26H29N3O2S
Mol. Mass.447.592
SMILESCN(CCOCCNC(=S)NC(=O)c1ccc(cc1)-c1ccccc1)Cc1ccccc1