Reaction Details
TargetAcetylcholinesterase
LigandBDBM50032384
Substrate/Competitorn/a
Meas. Tech.ChEMBL_29093 (CHEMBL636831)
IC50 13±n/a nM
Citation Vidaluc, JLCalmel, FBigg, DCCarilla, EBriley, M Flexible 1-[(2-aminoethoxy)alkyl]-3-ar(o)yl(thio)ureas as novel acetylcholinesterase inhibitors. Synthesis and biochemical evaluation. J Med Chem38:2969-73 (1995) Acetylcholinesterase
Name:Acetylcholinesterase
Type:Enzyme
Mol. Mass.:68193.62
Organism:Rattus norvegicus (rat)
Description:P37136
Residue:614
BDBM50032384
NameBDBM50032384
Synonyms:1-Benzoyl-3-{2-[2-(cyclohexyl-methyl-amino)-ethoxy]-ethyl}-thiourea N-(2-(2-(cyclohexyl(methyl)amino)ethoxy)ethylcarbamothioyl)benzamide
TypeSmall organic molecule
Emp. Form.C19H29N3O2S
Mol. Mass.363.517
SMILESCN(CCOCCNC(=S)NC(=O)c1ccccc1)C1CCCCC1