Reaction Details
TargetAcetylcholinesterase
LigandBDBM50032385
Substrate/Competitorn/a
Meas. Tech.ChEMBL_29093 (CHEMBL636831)
IC50 1800±n/a nM
Citation Vidaluc, JLCalmel, FBigg, DCCarilla, EBriley, M Flexible 1-[(2-aminoethoxy)alkyl]-3-ar(o)yl(thio)ureas as novel acetylcholinesterase inhibitors. Synthesis and biochemical evaluation. J Med Chem38:2969-73 (1995) Acetylcholinesterase
Name:Acetylcholinesterase
Type:Enzyme
Mol. Mass.:68193.62
Organism:Rattus norvegicus (rat)
Description:P37136
Residue:614
BDBM50032385
NameBDBM50032385
Synonyms:1-(2-(2-(benzyl(methyl)amino)ethoxy)ethyl)-3-(4-chlorophenyl)thiourea CHEMBL101988
TypeSmall organic molecule
Emp. Form.C19H24ClN3OS
Mol. Mass.377.931
SMILESCN(CCOCCNC(=S)Nc1ccc(Cl)cc1)Cc1ccccc1