Reaction Details
TargetAcetylcholinesterase
LigandBDBM50032386
Substrate/Competitorn/a
Meas. Tech.ChEMBL_29093 (CHEMBL636831)
IC50 77±n/a nM
Citation Vidaluc, JLCalmel, FBigg, DCCarilla, EBriley, M Flexible 1-[(2-aminoethoxy)alkyl]-3-ar(o)yl(thio)ureas as novel acetylcholinesterase inhibitors. Synthesis and biochemical evaluation. J Med Chem38:2969-73 (1995) Acetylcholinesterase
Name:Acetylcholinesterase
Type:Enzyme
Mol. Mass.:68193.62
Organism:Rattus norvegicus (rat)
Description:P37136
Residue:614
BDBM50032386
NameBDBM50032386
Synonyms:1-{2-[2-(Benzyl-methyl-amino)-ethoxy]-ethyl}-3-(4-methyl-benzoyl)-thiourea N-(2-(2-(benzyl(methyl)amino)ethoxy)ethylcarbamothioyl)-4-methylbenzamide
TypeSmall organic molecule
Emp. Form.C21H27N3O2S
Mol. Mass.385.523
SMILESCN(CCOCCNC(=S)NC(=O)c1ccc(C)cc1)Cc1ccccc1