Reaction Details
TargetAcetylcholinesterase
LigandBDBM50032387
Substrate/Competitorn/a
Meas. Tech.ChEMBL_29093 (CHEMBL636831)
IC50 1100±n/a nM
Citation Vidaluc, JLCalmel, FBigg, DCCarilla, EBriley, M Flexible 1-[(2-aminoethoxy)alkyl]-3-ar(o)yl(thio)ureas as novel acetylcholinesterase inhibitors. Synthesis and biochemical evaluation. J Med Chem38:2969-73 (1995) Acetylcholinesterase
Name:Acetylcholinesterase
Type:Enzyme
Mol. Mass.:68193.62
Organism:Rattus norvegicus (rat)
Description:P37136
Residue:614
BDBM50032387
NameBDBM50032387
Synonyms:1-Benzoyl-3-{3-[2-(benzyl-methyl-amino)-ethoxy]-propyl}-thiourea N-(3-(2-(benzyl(methyl)amino)ethoxy)propylcarbamothioyl)benzamide
TypeSmall organic molecule
Emp. Form.C21H27N3O2S
Mol. Mass.385.523
SMILESCN(CCOCCCNC(=S)NC(=O)c1ccccc1)Cc1ccccc1