Reaction Details
TargetAcetylcholinesterase
LigandBDBM50032389
Substrate/Competitorn/a
Meas. Tech.ChEMBL_29093 (CHEMBL636831)
IC50 4000±n/a nM
Citation Vidaluc, JLCalmel, FBigg, DCCarilla, EBriley, M Flexible 1-[(2-aminoethoxy)alkyl]-3-ar(o)yl(thio)ureas as novel acetylcholinesterase inhibitors. Synthesis and biochemical evaluation. J Med Chem38:2969-73 (1995) Acetylcholinesterase
Name:Acetylcholinesterase
Type:Enzyme
Mol. Mass.:68193.62
Organism:Rattus norvegicus (rat)
Description:P37136
Residue:614
BDBM50032389
NameBDBM50032389
Synonyms:1-{2-[2-(Benzyl-methyl-amino)-ethoxy]-ethyl}-3-pyridin-3-yl-thiourea | CHEMBL99606
TypeSmall organic molecule
Emp. Form.C18H24N4OS
Mol. Mass.344.474
SMILESCN(CCOCCNC(=S)Nc1cccnc1)Cc1ccccc1