Reaction Details
TargetAcetylcholinesterase
LigandBDBM50032388
Substrate/Competitorn/a
Meas. Tech.ChEMBL_29093 (CHEMBL636831)
IC50 1000±n/a nM
Citation Vidaluc, JLCalmel, FBigg, DCCarilla, EBriley, M Flexible 1-[(2-aminoethoxy)alkyl]-3-ar(o)yl(thio)ureas as novel acetylcholinesterase inhibitors. Synthesis and biochemical evaluation. J Med Chem38:2969-73 (1995) Acetylcholinesterase
Name:Acetylcholinesterase
Type:Enzyme
Mol. Mass.:68193.62
Organism:Rattus norvegicus (rat)
Description:P37136
Residue:614
BDBM50032388
NameBDBM50032388
Synonyms:1-(2-(2-(benzyl(methyl)amino)ethoxy)ethyl)-3-(4-(trifluoromethoxy)phenyl)thiourea CHEMBL101028
TypeSmall organic molecule
Emp. Form.C20H24F3N3O2S
Mol. Mass.427.484
SMILESCN(CCOCCNC(=S)Nc1ccc(OC(F)(F)F)cc1)Cc1ccccc1