Reaction Details
TargetAcetylcholinesterase
LigandBDBM50032390
Substrate/Competitorn/a
Meas. Tech.ChEMBL_29093 (CHEMBL636831)
IC50 15±n/a nM
Citation Vidaluc, JLCalmel, FBigg, DCCarilla, EBriley, M Flexible 1-[(2-aminoethoxy)alkyl]-3-ar(o)yl(thio)ureas as novel acetylcholinesterase inhibitors. Synthesis and biochemical evaluation. J Med Chem38:2969-73 (1995) Acetylcholinesterase
Name:Acetylcholinesterase
Type:Enzyme
Mol. Mass.:68193.62
Organism:Rattus norvegicus (rat)
Description:P37136
Residue:614
BDBM50032390
NameBDBM50032390
Synonyms:1-{2-[2-(Benzyl-methyl-amino)-ethoxy]-ethyl}-3-(3-nitro-benzoyl)-thiourea N-(2-(2-(benzyl(methyl)amino)ethoxy)ethylcarbamothioyl)-3-nitrobenzamide
TypeSmall organic molecule
Emp. Form.C20H24N4O4S
Mol. Mass.416.494
SMILESCN(CCOCCNC([S-])=[NH+]C(=O)c1cccc(c1)[N+]([O-])=O)Cc1ccccc1