Reaction Details
TargetAcetylcholinesterase
LigandBDBM50032392
Substrate/Competitorn/a
Meas. Tech.ChEMBL_29093 (CHEMBL636831)
IC50 1500±n/a nM
Citation Vidaluc, JLCalmel, FBigg, DCCarilla, EBriley, M Flexible 1-[(2-aminoethoxy)alkyl]-3-ar(o)yl(thio)ureas as novel acetylcholinesterase inhibitors. Synthesis and biochemical evaluation. J Med Chem38:2969-73 (1995) Acetylcholinesterase
Name:Acetylcholinesterase
Type:Enzyme
Mol. Mass.:68193.62
Organism:Rattus norvegicus (rat)
Description:P37136
Residue:614
BDBM50032392
NameBDBM50032392
Synonyms:1-(3,4-Dimethoxy-phenyl)-3-(2-{2-[methyl-(3-nitro-benzyl)-amino]-ethoxy}-ethyl)-thiourea CHEMBL329518
TypeSmall organic molecule
Emp. Form.C21H28N4O5S
Mol. Mass.448.536
SMILESCOc1ccc(NC(=[SH+])[N-]CCOCCN(C)Cc2cccc(c2)[N+]([O-])=O)cc1OC