Reaction Details
TargetAcetylcholinesterase
LigandBDBM50032391
Substrate/Competitorn/a
Meas. Tech.ChEMBL_29093 (CHEMBL636831)
IC50 13±n/a nM
Citation Vidaluc, JLCalmel, FBigg, DCCarilla, EBriley, M Flexible 1-[(2-aminoethoxy)alkyl]-3-ar(o)yl(thio)ureas as novel acetylcholinesterase inhibitors. Synthesis and biochemical evaluation. J Med Chem38:2969-73 (1995) Acetylcholinesterase
Name:Acetylcholinesterase
Type:Enzyme
Mol. Mass.:68193.62
Organism:Rattus norvegicus (rat)
Description:P37136
Residue:614
BDBM50032391
NameBDBM50032391
Synonyms:1-Benzoyl-3-[2-(1-benzyl-piperidin-4-yl)-ethyl]-thiourea | CHEMBL100020
TypeSmall organic molecule
Emp. Form.C22H27N3OS
Mol. Mass.381.534
SMILESO=C(NC(=S)NCCC1CCN(Cc2ccccc2)CC1)c1ccccc1