Reaction Details
TargetAcetylcholinesterase
LigandBDBM50032394
Substrate/Competitorn/a
Meas. Tech.ChEMBL_29093 (CHEMBL636831)
IC50 30±n/a nM
Citation Vidaluc, JLCalmel, FBigg, DCCarilla, EBriley, M Flexible 1-[(2-aminoethoxy)alkyl]-3-ar(o)yl(thio)ureas as novel acetylcholinesterase inhibitors. Synthesis and biochemical evaluation. J Med Chem38:2969-73 (1995) Acetylcholinesterase
Name:Acetylcholinesterase
Type:Enzyme
Mol. Mass.:68193.62
Organism:Rattus norvegicus (rat)
Description:P37136
Residue:614
BDBM50032394
NameBDBM50032394
Synonyms:1-{2-[2-(Benzyl-methyl-amino)-ethoxy]-ethyl}-3-(9-oxo-9H-fluorene-3-carbonyl)-thiourea | CHEMBL100819
TypeSmall organic molecule
Emp. Form.C27H27N3O3S
Mol. Mass.473.587
SMILESCN(CCOCCNC(=S)NC(=O)c1ccc2C(=O)c3ccccc3-c2c1)Cc1ccccc1