Reaction Details
TargetAcetylcholinesterase
LigandBDBM50032396
Substrate/Competitorn/a
Meas. Tech.ChEMBL_29093 (CHEMBL636831)
IC50 1400±n/a nM
Citation Vidaluc, JLCalmel, FBigg, DCCarilla, EBriley, M Flexible 1-[(2-aminoethoxy)alkyl]-3-ar(o)yl(thio)ureas as novel acetylcholinesterase inhibitors. Synthesis and biochemical evaluation. J Med Chem38:2969-73 (1995) Acetylcholinesterase
Name:Acetylcholinesterase
Type:Enzyme
Mol. Mass.:68193.62
Organism:Rattus norvegicus (rat)
Description:P37136
Residue:614
BDBM50032396
NameBDBM50032396
Synonyms:1-(2-(2-(benzyl(methyl)amino)ethoxy)ethyl)-3-cyclohexylthiourea CHEMBL99605
TypeSmall organic molecule
Emp. Form.C19H31N3OS
Mol. Mass.349.534
SMILESCN(CCOCCNC(=S)NC1CCCCC1)Cc1ccccc1