Reaction Details
TargetAcetylcholinesterase
LigandBDBM50032398
Substrate/Competitorn/a
Meas. Tech.ChEMBL_29093 (CHEMBL636831)
IC50 26±n/a nM
Citation Vidaluc, JLCalmel, FBigg, DCCarilla, EBriley, M Flexible 1-[(2-aminoethoxy)alkyl]-3-ar(o)yl(thio)ureas as novel acetylcholinesterase inhibitors. Synthesis and biochemical evaluation. J Med Chem38:2969-73 (1995) Acetylcholinesterase
Name:Acetylcholinesterase
Type:Enzyme
Mol. Mass.:68193.62
Organism:Rattus norvegicus (rat)
Description:P37136
Residue:614
BDBM50032398
NameBDBM50032398
Synonyms:1-{2-[2-(Benzyl-methyl-amino)-ethoxy]-ethyl}-3-(4-methoxy-benzoyl)-thiourea N-(2-(2-(benzyl(methyl)amino)ethoxy)ethylcarbamothioyl)-4-methoxybenzamide
TypeSmall organic molecule
Emp. Form.C21H27N3O3S
Mol. Mass.401.522
SMILESCOc1ccc(cc1)C(=O)NC(=S)NCCOCCN(C)Cc1ccccc1