Reaction Details
TargetAcetylcholinesterase
LigandBDBM50032400
Substrate/Competitorn/a
Meas. Tech.ChEMBL_29093 (CHEMBL636831)
IC50>10000±n/a nM
Citation Vidaluc, JLCalmel, FBigg, DCCarilla, EBriley, M Flexible 1-[(2-aminoethoxy)alkyl]-3-ar(o)yl(thio)ureas as novel acetylcholinesterase inhibitors. Synthesis and biochemical evaluation. J Med Chem38:2969-73 (1995) Acetylcholinesterase
Name:Acetylcholinesterase
Type:Enzyme
Mol. Mass.:68193.62
Organism:Rattus norvegicus (rat)
Description:P37136
Residue:614
BDBM50032400
NameBDBM50032400
Synonyms:1-Benzyl-3-{2-[2-(cyclohexylmethyl-ethyl-amino)-ethoxy]-ethyl}-urea CHEMBL329733
TypeSmall organic molecule
Emp. Form.C21H35N3O2
Mol. Mass.361.5215
SMILESCCN(CCOCCNC(=O)NCc1ccccc1)CC1CCCCC1