Reaction Details
TargetAcetylcholinesterase
LigandBDBM50032399
Substrate/Competitorn/a
Meas. Tech.ChEMBL_29093 (CHEMBL636831)
IC50>10000±n/a nM
Citation Vidaluc, JLCalmel, FBigg, DCCarilla, EBriley, M Flexible 1-[(2-aminoethoxy)alkyl]-3-ar(o)yl(thio)ureas as novel acetylcholinesterase inhibitors. Synthesis and biochemical evaluation. J Med Chem38:2969-73 (1995) Acetylcholinesterase
Name:Acetylcholinesterase
Type:Enzyme
Mol. Mass.:68193.62
Organism:Rattus norvegicus (rat)
Description:P37136
Residue:614
BDBM50032399
NameBDBM50032399
Synonyms:1-(2-(2-(benzyl(methyl)amino)ethoxy)ethyl)-3-(naphthalen-1-yl)thiourea CHEMBL420827
TypeSmall organic molecule
Emp. Form.C23H27N3OS
Mol. Mass.393.545
SMILESCN(CCOCCNC(=S)Nc1cccc2ccccc12)Cc1ccccc1