Reaction Details
TargetAlpha-1B adrenergic receptor
LigandBDBM50033109
Substrate/Competitorn/a
Meas. Tech.ChEMBL_34313 (CHEMBL648098)
Ki 0.110000±n/a nM
Citation Hieble, JPBondinell, WERuffolo, RR Alpha- and beta-adrenoceptors: from the gene to the clinic. 1. Molecular biology and adrenoceptor subclassification. J Med Chem38:3415-44 (1995) Alpha-1B adrenergic receptor
Name:Alpha-1B adrenergic receptor
Type:Enzyme
Mol. Mass.:56862.13
Organism:Homo sapiens (Human)
Description:P35368
Residue:520
BDBM50033109
NameBDBM50033109
Synonyms:2-(6,7-Dimethoxy-3,4-dihydro-1H-isoquinolin-2-yl)-6,7-dimethoxy-quinolin-4-ylamine CHEMBL324090
TypeSmall organic molecule
Emp. Form.C22H25N3O4
Mol. Mass.395.4516
SMILESCOc1cc2CCN(Cc2cc1OC)c1cc(N)c2cc(OC)c(OC)cc2n1