Reaction Details
TargetInterleukin-2 receptor subunit alpha
LigandBDBM50147974
Substrate/Competitorn/a
Meas. Tech.ChEMBL_921903 (CHEMBL3077414)
IC50 6000±n/a nM
Citation  TBA Med Chem Res22:5739-5751 (2013)    Article
 
Interleukin-2 receptor subunit alpha
Name:Interleukin-2 receptor subunit alpha
Type:PROTEIN
Mol. Mass.:30818.81
Organism:Homo sapiens (Human)
Description:EBI_182
Residue:272
BDBM50147974
NameBDBM50147974
Synonyms:(S)-2-[2-((R)-1-Carbamimidoyl-piperidin-3-yl)-acetylamino]-3-(4-phenylethynyl-phenyl)-propionic acid methyl ester CHEMBL419362
TypeSmall organic molecule
Emp. Form.C26H30N4O3
Mol. Mass.446.5414
SMILESCOC(=O)[C@H](Cc1ccc(cc1)C#Cc1ccccc1)NC(=O)C[C@H]1CCCN(C1)C(N)=N