Reaction Details
TargetPancreatic alpha-amylase
LigandBDBM50033640
Substrate/Competitorn/a
Meas. Tech.ChEMBL_35665 (CHEMBL649515)
EC50 3±n/a nM
Citation Amblard, MRodriguez, MLignon, MFGalas, MCBernad, NArtis-Noël, AMHauad, LLaur, JCalifano, JCAumelas, A Synthesis and biological evaluation of cholecystokinin analogs in which the Asp-Phe-NH2 moiety has been replaced by a 3-amino-7-phenylheptanoic acid or a 3-amino-6-(phenyloxy)hexanoic acid. J Med Chem36:3021-8 (1993) Pancreatic alpha-amylase
Name:Pancreatic alpha-amylase
Type:Protein
Mol. Mass.:57709.71
Organism:Homo sapiens (Human)
Description:n/a
Residue:511
BDBM50033640
NameBDBM50033640
Synonyms:2-{2-[2-(2-{2-[2-tert-Butoxycarbonylamino-3-(4-sulfo-phenyl)-propionylamino]-hexanoylamino}-acetylamino)-3-(1H-indol-3-yl)-propionylamino]-hexanoylamino}-succinic acid 1-phenethyl ester | CHEMBL274661
TypeSmall organic molecule
Emp. Form.C51H67N7O14S
Mol. Mass.1034.181
SMILESCCCC[C@H](NC(=O)[C@H](Cc1ccc(cc1)S(O)(=O)=O)NC(=O)OC(C)(C)C)C(=O)NCC(=O)N[C@@H](Cc1c[nH]c2ccccc12)C(=O)N[C@@H](CCCC)C(=O)N[C@@H](CC(O)=O)C(=O)OCCc1ccccc1