Reaction Details
TargetRNA-directed RNA polymerase
LigandBDBM50191523
Substrate/Competitorn/a
Meas. Tech.ChEMBL_932863 (CHEMBL3074361)
IC50 5888437±n/a nM
Citation  TBA Med Chem Res22:1866-1883 (2013)    Article
 
RNA-directed RNA polymerase
Name:RNA-directed RNA polymerase
Type:PROTEIN
Mol. Mass.:13231.83
Organism:Hepatitis C virus genotype 1
Description:ChEMBL_106647
Residue:121
BDBM50191523
NameBDBM50191523
Synonyms:2-{4-[5-(4-chlorophenyl)-2-methylthiazol-4-ylmethoxy]phenyl}-1-cyclohexyl-1H-benzimidazole-5-carboxylic acid | CHEMBL212583
TypeSmall organic molecule
Emp. Form.C31H28ClN3O3S
Mol. Mass.558.09
SMILESCc1nc(COc2ccc(cc2)-c2nc3cc(ccc3n2C2CCCCC2)C(O)=O)c(s1)-c1ccc(Cl)cc1